alternative label
type: Property
comment: Alternative writing format or language of the preferred label of a person or concept
range: Literal

preferred label
type: Property
comment: The label that is preferred to be used for a person or concept
range: Literal

has related
type: Property
comment: used to assert an associative link between two skos concepts
range: Concept

scope note
type: Property
comment: Notes are used to provide information relating to skos concepts
range: Literal

has broader
type: Property
comment: used to indicates that one skos concept is in some way more general (broader) than the other
range: Concept

has narrower
type: Property
comment: used to indicates that one skos concept is in some way less general (narrower) than the other
range: Concept

primary topic
type: Property
comment: The primary topic of some page or document
range: Thing

same as
type: Property
comment: These constructs may be used to create a number of different names that refer to the same individual
range: Thing

identifier
type: Property
comment: An unambiguous reference to the resource within a given context
range: Literal

subject
type: Property
comment: The topic of the resource, category or subject heading that further describes this resource. (broader category used to describe )
range: Thing

described at
type: Property
comment: Link to textual resource of encyclopedia article
range: Document

has abstract
type: Property
comment: The abstract of the article in which the concept or the person is described
range: Literal

has category
type: Property
comment: The category to which the concept was assigned to in the original data source
range: Concept

refer to
type: Property
comment: Used for redirection of one concept to another concept mostly in encyclopedias (when there is a name change or other reasons)
range: Concept

asWKT
type: Property
comment: The WKT serialization of a geometry
range: wktLiteral

gnd identifier
type: Property
comment: The identifier of the person or concept in the Integrated Authority File of the German National Library (GND)
range: Literal

birth date
type: Property
comment: The date of birth of the person
range: Literal

death date
type: Property
comment: The date of death of the person
range: Literal

birth location
type: Property
comment: The location of birth of the person
range: Literal

death location
type: Property
comment: The location of death of the person
range: Literal

occupation
type: Property
comment: The occupation of the person
range: Literal

has publication
type: Property
comment: The publications of the person
range: Literal

label
type: Property
comment: used to provide a human-readable version of a resource's name
range: Literal

created
type: Property
comment: Date of creation of the resource
range: Literal